BDBM540699 US11261190, Example 23
SMILES CCOC(=O)C1=C(CN2CCN3[C@H](CN(C3=O)c3ccc(CCC(O)=O)cc3)C2)NC(=N[C@H]1c1ccc(F)cc1Cl)c1nccs1
InChI Key InChIKey=HLGPWYXHSIXDKY-DWACAAAGSA-N
Data  1 EC50
  Tab Delimited (TSV)   2D SDfile   Computed 3D by Vconf -m prep SDfile
Find this compound or compounds like it in BindingDB:
Activity Spreadsheet -- Enzyme Inhibition Constant Data from BindingDB
Found 1 hit for monomerid = 540699
TargetLarge envelope protein(Hepatitis B virus)
Sunshine Lake Pharma
US Patent
LigandPNGBDBM540699(US11261190, Example 23)
Affinity DataEC50:  7nM. Assay description: 8000 HepG 2.2.15 cells per well were seeded into a 96-well plate, the plate was cultured at 37° C. and 5% CO2 for 3 days till the cells grew to full ...
Ligand InfoPC cidPC sid
In DepthDetails US Patent