BDBM540732 US11261190, Example 60B
SMILES COC[C@@H]1[C@H]2CN(C(=O)N2CCN1CC1=C([C@@H](N=C(N1)c1nccs1)c1ccc(F)cc1Cl)C(=O)OC)c1ccc(cc1)C(C)(C)C(=O)OC
InChI Key InChIKey=SHZMRTPJAPZGSJ-QQJNOOCOSA-N
Data  1 EC50
  Tab Delimited (TSV)   2D SDfile   Computed 3D by Vconf -m prep SDfile
Find this compound or compounds like it in BindingDB:
Activity Spreadsheet -- Enzyme Inhibition Constant Data from BindingDB
Found 1 hit for monomerid = 540732
TargetLarge envelope protein(Hepatitis B virus)
Sunshine Lake Pharma
US Patent
LigandPNGBDBM540732(US11261190, Example 60B)
Affinity DataEC50:  4nM. Assay description: 8000 HepG 2.2.15 cells per well were seeded into a 96-well plate, the plate was cultured at 37° C. and 5% CO2 for 3 days till the cells grew to full ...
Ligand InfoPC cidPC sid
In DepthDetails US Patent