BDBM540736 US11261211, Compound SA-4
SMILES C[C@]12CC[C@H]3[C@@H](CC[C@@H]4C[C@](C)(O)CC[C@H]34)[C@@H]1CC[C@@H]2C(=O)Cn1cc2ncccc2n1
InChI Key InChIKey=BTLWEEGNXUJKKB-GDKCFQAPSA-N
Data  1 IC50  1 EC50
  Tab Delimited (TSV)   2D SDfile   Computed 3D by Vconf -m prep SDfile
Find this compound or compounds like it in BindingDB:
Activity Spreadsheet -- Enzyme Inhibition Constant Data from BindingDB
Found 2 hits for monomerid = 540736
TargetGamma-aminobutyric acid receptor subunit alpha-1/beta-2/gamma-2(Homo sapiens (Human))
Sage Therapeutics
US Patent
LigandPNGBDBM540736(US11261211, Compound SA-4)
Affinity DataEC50:  1.50E+3nM. Assay description: This assay is not specified.
Ligand InfoPC cidPC sid
In DepthDetails US Patent
TargetGamma-aminobutyric acid receptor subunit alpha-1(Rattus norvegicus (Rat))
Sage Therapeutics
US Patent
LigandPNGBDBM540736(US11261211, Compound SA-4)
Affinity DataIC50: <10nM. Assay description: TBPS binding assays using rat brain cortical membranes in the presence of 5 μM GABA has been described (Gee et al, J. Pharmacol. Exp. Ther. 1987...
Ligand InfoPC cidPC sid
In DepthDetails US Patent