BDBM540799 Compound SA-51::US11261211, Compound SA-53
SMILES C[C@]12CC[C@H]3[C@@H](CC[C@@H]4C[C@](C)(O)CC[C@H]34)[C@@H]1CC[C@@H]2C(=O)Cn1nc2cc(F)c(F)cc2n1
InChI Key InChIKey=WOKJEACRUWOKDC-DCJZMTJOSA-N
Data  1 IC50
  Tab Delimited (TSV)   2D SDfile   Computed 3D by Vconf -m prep SDfile
Find this compound or compounds like it in BindingDB:
Activity Spreadsheet -- Enzyme Inhibition Constant Data from BindingDB
Found 1 hit for monomerid = 540799
TargetGamma-aminobutyric acid receptor subunit alpha-1(Rattus norvegicus (Rat))
Sage Therapeutics
US Patent
LigandPNGBDBM540799(Compound SA-51 | US11261211, Compound SA-53)
Affinity DataIC50:  30nM. Assay description: TBPS binding assays using rat brain cortical membranes in the presence of 5 μM GABA has been described (Gee et al, J. Pharmacol. Exp. Ther. 1987...
Ligand InfoPC cidPC sid
In DepthDetails US Patent