BDBM5411 4-(2-{3-[3-(thiophen-3-yl)pyrazolo[1,5-a]pyrimidin-6-yl]phenoxy}ethyl)morpholine::pyrazolo[1,5-a]pyrimidine 4c
SMILES C(CN1CCOCC1)Oc1cccc(c1)-c1cnc2c(cnn2c1)-c1ccsc1
InChI Key InChIKey=RIWXRSABMFAFHZ-UHFFFAOYSA-N
Data  1 IC50
  Tab Delimited (TSV)   2D SDfile   Computed 3D by Vconf -m prep SDfile
Find this compound or compounds like it in BindingDB:
Activity Spreadsheet -- Enzyme Inhibition Constant Data from BindingDB
Found 1 hit for monomerid = 5411
TargetVascular endothelial growth factor receptor 2(Homo sapiens (Human))
Merck Research Laboratories
LigandPNGBDBM5411(4-(2-{3-[3-(thiophen-3-yl)pyrazolo[1,5-a]pyrimidin...)
Affinity DataIC50:  14nMpH: 7.4 T: 2°C. Assay description: Activated KDR was incubated with 25 uM/10 uCi of [gamma-33P] ATP, poly-Glu/Tyr, and inhibitors in kinase buffer for 15 min at 22 °C. The reactio...
In DepthDetails ArticlePubMed