BDBM5412 dimethyl(3-{4-[3-(thiophen-3-yl)pyrazolo[1,5-a]pyrimidin-6-yl]phenoxy}propyl)amine::pyrazolo[1,5-a]pyrimidine 4d
SMILES CN(C)CCCOc1ccc(cc1)-c1cnc2c(cnn2c1)-c1ccsc1
InChI Key InChIKey=AMQUNUQXLQUCGJ-UHFFFAOYSA-N
Data  1 IC50
  Tab Delimited (TSV)   2D SDfile   Computed 3D by Vconf -m prep SDfile
Find this compound or compounds like it in BindingDB:
Activity Spreadsheet -- Enzyme Inhibition Constant Data from BindingDB
Found 1 hit for monomerid = 5412
TargetVascular endothelial growth factor receptor 2(Homo sapiens (Human))
Merck Research Laboratories
LigandPNGBDBM5412(dimethyl(3-{4-[3-(thiophen-3-yl)pyrazolo[1,5-a]pyr...)
Affinity DataIC50:  10nMpH: 7.4 T: 2°C. Assay description: Activated KDR was incubated with 25 uM/10 uCi of [gamma-33P] ATP, poly-Glu/Tyr, and inhibitors in kinase buffer for 15 min at 22 °C. The reactio...
In DepthDetails ArticlePubMed