BDBM5414 benzyl(2-methoxyethyl)(2-{4-[3-(thiophen-3-yl)pyrazolo[1,5-a]pyrimidin-6-yl]phenoxy}ethyl)amine::pyrazolo[1,5-a]pyrimidine 4f
SMILES COCCN(CCOc1ccc(cc1)-c1cnc2c(cnn2c1)-c1ccsc1)Cc1ccccc1
InChI Key InChIKey=SYXUIDNWCZVPRH-UHFFFAOYSA-N
Data  1 IC50
  Tab Delimited (TSV)   2D SDfile   Computed 3D by Vconf -m prep SDfile
Find this compound or compounds like it in BindingDB:
Activity Spreadsheet -- Enzyme Inhibition Constant Data from BindingDB
Found 1 hit for monomerid = 5414
TargetVascular endothelial growth factor receptor 2(Homo sapiens (Human))
Merck Research Laboratories
LigandPNGBDBM5414(benzyl(2-methoxyethyl)(2-{4-[3-(thiophen-3-yl)pyra...)
Affinity DataIC50:  19nMpH: 7.4 T: 2°C. Assay description: Activated KDR was incubated with 25 uM/10 uCi of [gamma-33P] ATP, poly-Glu/Tyr, and inhibitors in kinase buffer for 15 min at 22 °C. The reactio...
In DepthDetails ArticlePubMed