BDBM543125 US11279697, Compound 284-P1
SMILES COc1cc(OC)c(Cl)c([C@@H]2CCc3c(C2)[nH]nc3-c2ccc(cc2NC(=O)C=C)N(C)C)c1Cl
InChI Key
Data  1 IC50
  Tab Delimited (TSV)   2D SDfile   Computed 3D by Vconf -m prep SDfile
Find this compound or compounds like it in BindingDB:
Activity Spreadsheet -- Enzyme Inhibition Constant Data from BindingDB
Found 1 hit for monomerid = 543125
TargetFibroblast growth factor receptor 4(Homo sapiens (Human))
Bioardis
US Patent
LigandPNGBDBM543125(US11279697, Compound 284-P1)
Affinity DataIC50:  628nM. Assay description: A HTRF KinEASE-TK 20000 tests kinase assay kit from CISBIO Corp. was used. The kit provided a biotin-labeled substrate, an EU-labeled phosphorylation...
Ligand InfoPC cidPC sid
In DepthDetails US Patent