BDBM543440 US11279697, Compound 301-P1
SMILES COc1cc(OC)c(F)c([C@@H]2CCc3c(C2)[nH]nc3-c2cc(ccc2NC(=O)C=C)N2CCN(C)CC2)c1F
InChI Key
Data  1 IC50
  Tab Delimited (TSV)   2D SDfile   Computed 3D by Vconf -m prep SDfile
Find this compound or compounds like it in BindingDB:
Activity Spreadsheet -- Enzyme Inhibition Constant Data from BindingDB
Found 1 hit for monomerid = 543440
TargetFibroblast growth factor receptor 4(Homo sapiens (Human))
Bioardis
US Patent
LigandPNGBDBM543440(US11279697, Compound 301-P1)
Affinity DataIC50:  3.40nM. Assay description: A HTRF KinEASE-TK 20000 tests kinase assay kit from CISBIO Corp. was used. The kit provided a biotin-labeled substrate, an EU-labeled phosphorylation...
Ligand InfoPC cidPC sid
In DepthDetails US Patent