BDBM543447 US11279697, Compound 310-P1
SMILES COc1cc(OC)cc(c1)[C@@H]1CCc2c(C1)[nH]nc2-c1c(NC(=O)C=C)cnn1C
InChI Key
Data  1 IC50
  Tab Delimited (TSV)   2D SDfile   Computed 3D by Vconf -m prep SDfile
Find this compound or compounds like it in BindingDB:
Activity Spreadsheet -- Enzyme Inhibition Constant Data from BindingDB
Found 1 hit for monomerid = 543447
TargetFibroblast growth factor receptor 4(Homo sapiens (Human))
Bioardis
US Patent
LigandPNGBDBM543447(US11279697, Compound 310-P1)
Affinity DataIC50:  446nM. Assay description: A HTRF KinEASE-TK 20000 tests kinase assay kit from CISBIO Corp. was used. The kit provided a biotin-labeled substrate, an EU-labeled phosphorylation...
Ligand InfoPC cidPC sid
In DepthDetails US Patent