BDBM545 4-cyano-N-(3-{1-[4-hydroxy-2-oxo-6-(2-phenylethyl)-6-propyl-5,6-dihydro-2H-pyran-3-yl]propyl}phenyl)benzene-1-sulfonamide::CHEMBL21281::Sulfonamide-Containing 5,6-Dihydro-4-hydroxy-2-pyrones::Tipranavir analog 2
SMILES CCCC1(CCc2ccccc2)CC(=O)C(C(CC)c2cccc(NS(=O)(=O)c3ccc(cc3)C#N)c2)C(=O)O1
InChI Key InChIKey=BQKCUXNGMWFRMA-UHFFFAOYSA-N
Data  3 KI
  Tab Delimited (TSV)   2D SDfile   Computed 3D by Vconf -m prep SDfile
Find this compound or compounds like it in BindingDB:
Activity Spreadsheet -- Enzyme Inhibition Constant Data from BindingDB
Found 3 hits for monomerid = 545
TargetDimer of Gag-Pol polyprotein [489-587](Human immunodeficiency virus type 1)
Upjohn
LigandPNGBDBM545(4-cyano-N-(3-{1-[4-hydroxy-2-oxo-6-(2-phenylethyl)...)
Affinity DataKi:  8nM ΔG°:  -10.9kcal/molepH: 5.0 T: 2°C. Assay description: HIV-1 protease was purified and refolded from E. coli inclusion bodies. The substrate used spans the p17-p24 processing site (R-V-S-Q-N-Y-P-I-V-Q-N-K...
In DepthDetails ArticlePubMed
TargetGag-Pol polyprotein [489-587](Human immunodeficiency virus type 1)
Pharmacia & Upjohn
Curated by ChEMBL
LigandPNGBDBM545(4-cyano-N-(3-{1-[4-hydroxy-2-oxo-6-(2-phenylethyl)...)
Affinity DataKi:  8nM. Assay description: Compound was evaluated for in vitro inhibition of human immunodeficiency virus type 1 (HIV-1) Protease
In DepthDetails ArticlePubMed
TargetDimer of Gag-Pol polyprotein [489-587](Human immunodeficiency virus type 1)
Upjohn
LigandPNGBDBM545(4-cyano-N-(3-{1-[4-hydroxy-2-oxo-6-(2-phenylethyl)...)
Affinity DataKi:  8.20nM ΔG°:  -10.9kcal/molepH: 5.0 T: 2°C. Assay description: HIV-1 protease was purified and refolded from E. coli inclusion bodies. The substrate used spans the p17-p24 processing site (R-V-S-Q-N-Y-P-I-V-Q-N-K...
In DepthDetails ArticlePubMed