BDBM548302 WO2022093820, Compound 70
SMILES C[C@H](CO)C1CNC(=O)c2cc(nn12)N1CCOC[C@H]1C
InChI Key InChIKey=XMNNRXPKUYJRRT-UVTZGIPTSA-N
Data  1 IC50
  Tab Delimited (TSV)   2D SDfile   Computed 3D by Vconf -m prep SDfile
Find this compound or compounds like it in BindingDB:
Activity Spreadsheet -- Enzyme Inhibition Constant Data from BindingDB
Found 1 hit for monomerid = 548302
TargetPhosphatidylinositol 3-kinase catalytic subunit type 3(Homo sapiens (Human))
Genentech
WIPO
LigandPNGBDBM548302(WO2022093820, Compound 70)
Affinity DataIC50:  532nM. Assay description:  [0194] Experimental compound in DMSO was dispensed to a 384-well microplate via acoustic dispenser at 50 nl per well. At 2.5 µl per well, an enzyme ...
Ligand InfoPC cidPC sid
In DepthDetails PubMed