BDBM549180 N4-tert-butyl-N2-methyl-5-oxido-N2-(2-tetrahydropyran-4-ylethyl)-6,7-dihydrothieno[3,2-d]pyrimidin-5-ium-2,4-diamine::US11299497, Example 3
SMILES CN(CCC1CCOCC1)c1nc2CC[S+]([O-])c2c(NC(C)(C)C)n1
InChI Key InChIKey=KMOVYYLMBGGDCV-UHFFFAOYSA-N
Data  1 IC50
  Tab Delimited (TSV)   2D SDfile   Computed 3D by Vconf -m prep SDfile
Find this compound or compounds like it in BindingDB:
Activity Spreadsheet -- Enzyme Inhibition Constant Data from BindingDB
Found 1 hit for monomerid = 549180
TargetcAMP-specific 3',5'-cyclic phosphodiesterase 4D [380-741](Homo sapiens (Human))
Union Therapeutics
US Patent
LigandPNGBDBM549180(N4-tert-butyl-N2-methyl-5-oxido-N2-(2-tetrahydropy...)
Affinity DataIC50:  30nM. Assay description: The human PDE41 Dcatalytic domain (UniProt no. Q08499 [S380-L740]) was incubated with a mixture of non-labelled cAMP (cyclic adenosine monophosphate)...
Ligand InfoPC cidPC sid
In DepthDetails US Patent