BDBM549295 2-chloro-N- isobutyl-5-oxido- 6,7-dihydro- thieno[3,2-d]pyrimi- din-5-ium-4-amine::US11299497, Example 10
SMILES CN(CCC1CCOCC1)c1nc2CC[S@@+]([O-])c2c(NC2(CCC2)C#N)n1
InChI Key InChIKey=UNBKFQZTZGBDJZ-HHHXNRCGSA-N
Data  1 IC50
  Tab Delimited (TSV)   2D SDfile   Computed 3D by Vconf -m prep SDfile
Find this compound or compounds like it in BindingDB:
Activity Spreadsheet -- Enzyme Inhibition Constant Data from BindingDB
Found 1 hit for monomerid = 549295
TargetcAMP-specific 3',5'-cyclic phosphodiesterase 4D [380-741](Homo sapiens (Human))
Union Therapeutics
US Patent
LigandPNGBDBM549295(2-chloro-N- isobutyl-5-oxido- 6,7-dihydro- thieno[...)
Affinity DataIC50:  30nM. Assay description: The human PDE41 Dcatalytic domain (UniProt no. Q08499 [S380-L740]) was incubated with a mixture of non-labelled cAMP (cyclic adenosine monophosphate)...
Ligand InfoPC cidPC sid
In DepthDetails US Patent