BDBM549301 2-chloro-N-[(1R)-1- methylpropyl]-5- oxido-6,7-dihydro- thieno[3,2-d]pyrimi- din-5-ium-4-amine::US11299497, Example 16
SMILES COc1cccc(Nc2nc(nc3CC[S@@+]([O-])c23)N(C)CCC2CCOCC2)c1
InChI Key InChIKey=QTAYTESMHCRJFN-GDLZYMKVSA-N
Data  1 IC50
  Tab Delimited (TSV)   2D SDfile   Computed 3D by Vconf -m prep SDfile
Find this compound or compounds like it in BindingDB:
Activity Spreadsheet -- Enzyme Inhibition Constant Data from BindingDB
Found 1 hit for monomerid = 549301
TargetcAMP-specific 3',5'-cyclic phosphodiesterase 4D [380-741](Homo sapiens (Human))
Union Therapeutics
US Patent
LigandPNGBDBM549301(2-chloro-N-[(1R)-1- methylpropyl]-5- oxido-6,7-dih...)
Affinity DataIC50: <10nM. Assay description: The human PDE41 Dcatalytic domain (UniProt no. Q08499 [S380-L740]) was incubated with a mixture of non-labelled cAMP (cyclic adenosine monophosphate)...
Ligand InfoPC cidPC sid
In DepthDetails US Patent