BDBM549623 US11306078, Example 1.04
SMILES CC(NC(=O)[C@@H]1CN(CC[C@H]1NC(=O)c1cc(on1)-c1ccc(F)cc1F)C1CCCCC1)c1ccccn1
InChI Key InChIKey=MXCWYLRFOQOZOR-ADIBTGSQSA-N
Data  1 IC50
  Tab Delimited (TSV)   2D SDfile   Computed 3D by Vconf -m prep SDfile
Find this compound or compounds like it in BindingDB:
Activity Spreadsheet -- Enzyme Inhibition Constant Data from BindingDB
Found 1 hit for monomerid = 549623
TargetAtypical chemokine receptor 3(Homo sapiens (Human))
Idorsia Pharmaceuticals
US Patent
LigandPNGBDBM549623(US11306078, Example 1.04)
Affinity DataIC50:  7nM. Assay description: Tango CXCR7-bla U2OS cells are detached from culture dishes with 0.05% trypsin-EDTA and collected in growing medium (McCoy's 5A 90% (v/v), dialyz...
Ligand InfoPC cidPC sid
In DepthDetails US Patent