BDBM549713 (3R*,4R*)-1-Cyclohexyl-4-{[5-(2,4,6-trifluoro-phenyl)-isoxazole-3- carbonyl]-amino}-piperidine-3-carboxylic acid ((R)-1-pyridin-2-yl-ethyl)- amide (enantiomer 2)::US11306078, Example 1.121b
SMILES C[C@@H](NC(=O)[C@H]1CN(CC[C@@H]1NC(=O)c1cc(on1)-c1c(F)cc(F)cc1F)C1CCCCC1)c1ccccn1
InChI Key InChIKey=RKRQXLPZLZWUJX-YQOVMPOYSA-N
Data  1 IC50
  Tab Delimited (TSV)   2D SDfile   Computed 3D by Vconf -m prep SDfile
Find this compound or compounds like it in BindingDB:
Activity Spreadsheet -- Enzyme Inhibition Constant Data from BindingDB
Found 1 hit for monomerid = 549713
TargetAtypical chemokine receptor 3(Homo sapiens (Human))
Idorsia Pharmaceuticals
US Patent
LigandPNGBDBM549713((3R*,4R*)-1-Cyclohexyl-4-{[5-(2,4,6-trifluoro-phen...)
Affinity DataIC50:  2nM. Assay description: Tango CXCR7-bla U2OS cells are detached from culture dishes with 0.05% trypsin-EDTA and collected in growing medium (McCoy's 5A 90% (v/v), dialyz...
Ligand InfoPC cidPC sid
In DepthDetails US Patent