BDBM549785 US11306078, Example 1.176::US11306078, Example 1.176a::rac-(3R*,4R*)-1-Cyclopentyl-4-{[5-(2,4,6-trifluoro-phenyl)-isoxazole-3- carbonyl]-amino}-piperidine-3-carboxylic acid (1-pyrimidin-2-yl- cyclopropyl)-amide
SMILES Fc1cc(F)c(-c2cc(no2)C(=O)N[C@@H]2CCN(C[C@H]2C(=O)NC2(CC2)c2ncccn2)C2CCCC2)c(F)c1
InChI Key InChIKey=VIWSYBHQDGBSTN-WIYYLYMNSA-N
Data  2 IC50
  Tab Delimited (TSV)   2D SDfile   Computed 3D by Vconf -m prep SDfile
Find this compound or compounds like it in BindingDB:
Activity Spreadsheet -- Enzyme Inhibition Constant Data from BindingDB
Found 2 hits for monomerid = 549785
TargetAtypical chemokine receptor 3(Homo sapiens (Human))
Idorsia Pharmaceuticals
US Patent
LigandPNGBDBM549785(US11306078, Example 1.176 | US11306078, Example 1....)
Affinity DataIC50:  5nM. Assay description: Tango CXCR7-bla U2OS cells are detached from culture dishes with 0.05% trypsin-EDTA and collected in growing medium (McCoy's 5A 90% (v/v), dialyz...
Ligand InfoPC cidPC sid
In DepthDetails US Patent
TargetAtypical chemokine receptor 3(Homo sapiens (Human))
Idorsia Pharmaceuticals
US Patent
LigandPNGBDBM549785(US11306078, Example 1.176 | US11306078, Example 1....)
Affinity DataIC50:  6nM. Assay description: Tango CXCR7-bla U2OS cells are detached from culture dishes with 0.05% trypsin-EDTA and collected in growing medium (McCoy's 5A 90% (v/v), dialyz...
Ligand InfoPC cidPC sid
In DepthDetails US Patent