BDBM549915 (3S,4S)-1-Bicyclo[3.1.0]hex-3-yl-4-{[5-(2,4-difluoro-phenyl)-isoxazole-3- carbonyl]-amino}-piperidine-3-carboxylic acid (1-pyrimidin-2-yl- cyclopropyl)-amide::US11306078, Example 2.094
SMILES Fc1ccc(-c2cc(no2)C(=O)N[C@H]2CCN(C[C@@H]2C(=O)NC2(CC2)c2ncccn2)C2CC3CC3C2)c(F)c1
InChI Key InChIKey=HYLBCESFBRRXFI-SBBBWDDSSA-N
Data  1 IC50
  Tab Delimited (TSV)   2D SDfile   Computed 3D by Vconf -m prep SDfile
Find this compound or compounds like it in BindingDB:
Activity Spreadsheet -- Enzyme Inhibition Constant Data from BindingDB
Found 1 hit for monomerid = 549915
TargetAtypical chemokine receptor 3(Homo sapiens (Human))
Idorsia Pharmaceuticals
US Patent
LigandPNGBDBM549915((3S,4S)-1-Bicyclo[3.1.0]hex-3-yl-4-{[5-(2,4-difluo...)
Affinity DataIC50:  2nM. Assay description: Tango CXCR7-bla U2OS cells are detached from culture dishes with 0.05% trypsin-EDTA and collected in growing medium (McCoy's 5A 90% (v/v), dialyz...
Ligand InfoPC cidPC sid
In DepthDetails US Patent