BDBM550032 (3S,4S)-1-Cyclopropylmethyl-4-{[5-(2,4-difluoro-phenyl)-isoxazole-3- carbonyl]-amino}-piperidine-3-carboxylic acid [(R)-1-(3-bromo-phenyl)- ethyl]-amide::US11306078, Example 4.075
SMILES C[C@@H](NC(=O)[C@H]1CN(CC2CC2)CC[C@@H]1NC(=O)c1cc(on1)-c1ccc(F)cc1F)c1cccc(Br)c1
InChI Key InChIKey=IPQBBZIOURYIQT-LZGLPUDESA-N
Data  1 IC50
  Tab Delimited (TSV)   2D SDfile   Computed 3D by Vconf -m prep SDfile
Find this compound or compounds like it in BindingDB:
Activity Spreadsheet -- Enzyme Inhibition Constant Data from BindingDB
Found 1 hit for monomerid = 550032
TargetAtypical chemokine receptor 3(Homo sapiens (Human))
Idorsia Pharmaceuticals
US Patent
LigandPNGBDBM550032((3S,4S)-1-Cyclopropylmethyl-4-{[5-(2,4-difluoro-ph...)
Affinity DataIC50:  2nM. Assay description: Tango CXCR7-bla U2OS cells are detached from culture dishes with 0.05% trypsin-EDTA and collected in growing medium (McCoy's 5A 90% (v/v), dialyz...
Ligand InfoPC cidPC sid
In DepthDetails US Patent