BDBM551731 US11312722, Compound 21
SMILES COc1ccc(Cn2nc(cc2Nc2cc(O)cc(O)c2C(=O)N2Cc3ccccc3C2)-c2ccccc2)cc1
InChI Key InChIKey=XSPLLTVMPBKNEU-UHFFFAOYSA-N
Data  2 EC50
  Tab Delimited (TSV)   2D SDfile   Computed 3D by Vconf -m prep SDfile
Find this compound or compounds like it in BindingDB:
Activity Spreadsheet -- Enzyme Inhibition Constant Data from BindingDB
Found 2 hits for monomerid = 551731
TargetHeat shock protein 90 homolog(Yeast)
Trustees Of Boston University
US Patent
LigandPNGBDBM551731(US11312722, Compound 21)
Affinity DataEC50:  511nM. Assay description: EC50 values were determined by FP-based equilibrium competition assay performed in 384-well format using whole cell lysates prepared from C. neoforma...
Ligand InfoPC cidPC sid
In DepthDetails US Patent
TargetHsp90 chaperone protein kinase-targeting subunit(Filobasidiella neoformans)
Trustees Of Boston University
US Patent
LigandPNGBDBM551731(US11312722, Compound 21)
Affinity DataEC50:  877nM. Assay description: EC50 values were determined by FP-based equilibrium competition assay performed in 384-well format using whole cell lysates prepared from C. neoforma...
Ligand InfoPC cidPC sid
In DepthDetails US Patent