BDBM551749 US11312722, Compound 39
SMILES CCN(CC)C(=O)c1c(O)cc(O)cc1Nc1cc(nn1Cc1ccc(OC)cc1)-c1ccccc1
InChI Key InChIKey=QHTICQFSDIQUKD-UHFFFAOYSA-N
Data  2 EC50
  Tab Delimited (TSV)   2D SDfile   Computed 3D by Vconf -m prep SDfile
Find this compound or compounds like it in BindingDB:
Activity Spreadsheet -- Enzyme Inhibition Constant Data from BindingDB
Found 2 hits for monomerid = 551749
TargetHeat shock protein 90 homolog(Yeast)
Trustees Of Boston University
US Patent
LigandPNGBDBM551749(US11312722, Compound 39)
Affinity DataEC50: >1.00E+4nM. Assay description: EC50 values were determined by FP-based equilibrium competition assay performed in 384-well format using whole cell lysates prepared from C. neoforma...
Ligand InfoPC cidPC sid
In DepthDetails US Patent
TargetHsp90 chaperone protein kinase-targeting subunit(Filobasidiella neoformans)
Trustees Of Boston University
US Patent
LigandPNGBDBM551749(US11312722, Compound 39)
Affinity DataEC50: >1.00E+4nM. Assay description: EC50 values were determined by FP-based equilibrium competition assay performed in 384-well format using whole cell lysates prepared from C. neoforma...
Ligand InfoPC cidPC sid
In DepthDetails US Patent