BDBM552684 (2S,4R)-N-((R)-3-([l,l'-biphenyl]-4-yl)-l-amino-l-oxopropan-2-yl)-l-((S)-2-(4-cyclopropyl-lH-l,2,3-triazol-l-yl)-3,3-dimethylbutanoyl)-4-hydroxypyrrolidine-2-carboxamide ( Compound 3 )::WO2022103411, Example S3
SMILES CC(C)(C)[C@@H](C(=O)N1C[C@H](O)CC1C(=O)N[C@H](Cc1ccc(cc1)-c1ccccc1)C(N)=O)n1cc(nn1)C1CC1
InChI Key InChIKey=DPJOJCHWMWBSKQ-JXPRAFDXSA-N
Data  2 IC50
  Tab Delimited (TSV)   2D SDfile   Computed 3D by Vconf -m prep SDfile
Find this compound or compounds like it in BindingDB:
Activity Spreadsheet -- Enzyme Inhibition Constant Data from BindingDB
Found 2 hits for monomerid = 552684
Targetvon Hippel-Lindau disease tumor suppressor(Homo sapiens (Human))
Genentech
WIPO
LigandPNGBDBM552684((2S,4R)-N-((R)-3-([l,l'-biphenyl]-4-yl)-l-amino-l-...)
Affinity DataIC50:  150nM. Assay description: The VHL NanoBRET™ Target Engagement Assay analyzes the apparent affinity of test compounds for VHL in cells by competitive displacement of a VHL Nano...
Ligand InfoPC cidPC sid
In DepthDetails PubMed
Targetvon Hippel-Lindau disease tumor suppressor(Homo sapiens (Human))
Genentech
WIPO
LigandPNGBDBM552684((2S,4R)-N-((R)-3-([l,l'-biphenyl]-4-yl)-l-amino-l-...)
Affinity DataIC50:  150nM. Assay description: The binding of test compounds to the VHL Elongin B/C complex was measured using a fluorescence polarization tracer competition assay. The VHL / Elong...
Ligand InfoPC cidPC sid
In DepthDetails PubMed