BDBM552703 (2S,4R)-l-((S)-2-cyclohexyl-2-(4-cyclopropyl-lH-l,2,3-triazol-l-yl)acetyl)-4-hydroxy-N-((S)-l-(4-(4-methylthiazol-5-yl)phenyl)ethyl)pyrrolidine-2-carboxamide (Compound 19)::WO2022103411, Example S19
SMILES C[C@H](NC(=O)[C@@H]1C[C@@H](O)CN1C(=O)[C@H](C1CCCCC1)n1cc(nn1)C1CC1)c1ccc(cc1)-c1scnc1C
InChI Key InChIKey=CRONOEXIBVALGH-PWXWPJMESA-N
Data  1 IC50
  Tab Delimited (TSV)   2D SDfile   Computed 3D by Vconf -m prep SDfile
Find this compound or compounds like it in BindingDB:
Activity Spreadsheet -- Enzyme Inhibition Constant Data from BindingDB
Found 1 hit for monomerid = 552703
Targetvon Hippel-Lindau disease tumor suppressor(Homo sapiens (Human))
Genentech
WIPO
LigandPNGBDBM552703((2S,4R)-l-((S)-2-cyclohexyl-2-(4-cyclopropyl-lH-l,...)
Affinity DataIC50: <5nM. Assay description: The VHL NanoBRET™ Target Engagement Assay analyzes the apparent affinity of test compounds for VHL in cells by competitive displacement of a VHL Nano...
Ligand InfoPC cidPC sid
In DepthDetails PubMed