BDBM55272 MLS000089754::N-[4-(benzylsulfamoyl)phenyl]carbamic acid ethyl ester::N-[4-[(phenylmethyl)sulfamoyl]phenyl]carbamic acid ethyl ester::SMR000024372::cid_571682::ethyl 4-[(benzylamino)sulfonyl]phenylcarbamate::ethyl N-[4-(benzylsulfamoyl)phenyl]carbamate::ethyl N-[4-[(phenylmethyl)sulfamoyl]phenyl]carbamate
SMILES CCOC(=O)Nc1ccc(cc1)S(=O)(=O)NCc1ccccc1
InChI Key InChIKey=WFAMBNJDENGUOQ-UHFFFAOYSA-N
Data  1 IC50
  Tab Delimited (TSV)   2D SDfile   Computed 3D by Vconf -m prep SDfile
Find this compound or compounds like it in BindingDB:
Activity Spreadsheet -- Enzyme Inhibition Constant Data from BindingDB
Found 1 hit for monomerid = 55272
TargetNeutrophil cytosol factor 1 [S99G](Homo sapiens (Human))
Emory University
Curated by PubChem BioAssay
LigandPNGBDBM55272(MLS000089754 | N-[4-(benzylsulfamoyl)phenyl]carbam...)
Affinity DataIC50:  5.00E+4nM. Assay description: NIH Molecular Libraries Screening Centers Network [MLSCN] Emory Chemical Biology Discovery Center in MLSCN Assay provider: Susan Smith, Emory Univers...
In DepthDetails PCBioAssay