BDBM552730 (2S,4R)-l-((S)-2-(4-cyclopropyl-lH-l,2,3-triazol-l-yl)-3,3-dimethylbutanoyl)-4-hydroxy-N-((S)-2-(4-methylthiazol-5-yl)-6,7,8,9-tetrahydro-5H-benzo[7]annulen-5-yl)pyrrolidine-2-carboxamide (Compound 53)::WO2022103411, Compound 53::WO2022103411, Example S45
SMILES Cc1ncsc1-c1ccc2[C@@H](CCCCc2c1)NC(=O)[C@@H]1C[C@@H](O)CN1C(=O)[C@@H](n1cc(nn1)C1CC1)C(C)(C)C
InChI Key InChIKey=IAVGSVXQQSNQFO-PVRUFOIFSA-N
Data  1 IC50
  Tab Delimited (TSV)   2D SDfile   Computed 3D by Vconf -m prep SDfile
Find this compound or compounds like it in BindingDB:
Activity Spreadsheet -- Enzyme Inhibition Constant Data from BindingDB
Found 1 hit for monomerid = 552730
Targetvon Hippel-Lindau disease tumor suppressor(Homo sapiens (Human))
Genentech
WIPO
LigandPNGBDBM552730((2S,4R)-l-((S)-2-(4-cyclopropyl-lH-l,2,3-triazol-l...)
Affinity DataIC50:  200nM. Assay description: The VHL NanoBRET™ Target Engagement Assay analyzes the apparent affinity of test compounds for VHL in cells by competitive displacement of a VHL Nano...
Ligand InfoPC cidPC sid
In DepthDetails PubMed