BDBM55315 MLS000065641::N-[4-ethyl-5-methyl-3-(piperidine-1-carbonyl)-2-thienyl]carbamic acid methyl ester::N-[4-ethyl-5-methyl-3-[oxo(1-piperidinyl)methyl]-2-thiophenyl]carbamic acid methyl ester::SMR000080282::cid_1245049::methyl N-(4-ethyl-5-methyl-3-piperidin-1-ylcarbonyl-thiophen-2-yl)carbamate::methyl N-[4-ethyl-5-methyl-3-(piperidine-1-carbonyl)thiophen-2-yl]carbamate::methyl [4-ethyl-5-methyl-3-(1-piperidinylcarbonyl)-2-thienyl]carbamate
SMILES CCc1c(C)sc(NC(=O)OC)c1C(=O)N1CCCCC1
InChI Key InChIKey=DTQAWNDSGCAZEY-UHFFFAOYSA-N
Data  2 IC50
  Tab Delimited (TSV)   2D SDfile   Computed 3D by Vconf -m prep SDfile
Find this compound or compounds like it in BindingDB:
Activity Spreadsheet -- Enzyme Inhibition Constant Data from BindingDB
Found 2 hits for monomerid = 55315
TargetE3 ubiquitin-protein ligase XIAP(Homo sapiens (Human))
Sanford-Burnham Center For Chemical Genomics
Curated by PubChem BioAssay
LigandPNGBDBM55315(MLS000065641 | N-[4-ethyl-5-methyl-3-(piperidine-1...)
Affinity DataIC50:  2.50E+4nM. Assay description: Data Source: Sanford-Burnham Center for Chemical Genomics (SBCCG) Source Affiliation: Sanford-Burnham Medical Research Institute (SBMRI, San Diego, C...
In DepthDetails PCBioAssay
TargetNeutrophil cytosol factor 1 [S99G](Homo sapiens (Human))
Emory University
Curated by PubChem BioAssay
LigandPNGBDBM55315(MLS000065641 | N-[4-ethyl-5-methyl-3-(piperidine-1...)
Affinity DataIC50:  1.79E+4nM. Assay description: NIH Molecular Libraries Screening Centers Network [MLSCN] Emory Chemical Biology Discovery Center in MLSCN Assay provider: Susan Smith, Emory Univers...
In DepthDetails PCBioAssay