BDBM55385 2-(2-ketoquinoxalin-1-yl)acetic acid ethyl ester::2-(2-oxo-1-quinoxalinyl)acetic acid ethyl ester::MLS000541560::SMR000126418::cid_3727805::ethyl 2-(2-oxidanylidenequinoxalin-1-yl)ethanoate::ethyl 2-(2-oxoquinoxalin-1-yl)acetate::ethyl 2-(3-oxo-3,4-dihydro-4-quinolinyl)acetate
SMILES CCOC(=O)Cn1c2ccccc2ncc1=O
InChI Key InChIKey=NFWMSGZOFCQKCT-UHFFFAOYSA-N
Data  1 IC50
  Tab Delimited (TSV)   2D SDfile   Computed 3D by Vconf -m prep SDfile
Find this compound or compounds like it in BindingDB:
Activity Spreadsheet -- Enzyme Inhibition Constant Data from BindingDB
Found 1 hit for monomerid = 55385
TargetNeutrophil cytosol factor 1 [S99G](Homo sapiens (Human))
Emory University
Curated by PubChem BioAssay
LigandPNGBDBM55385(2-(2-ketoquinoxalin-1-yl)acetic acid ethyl ester |...)
Affinity DataIC50:  5.00E+4nM. Assay description: NIH Molecular Libraries Screening Centers Network [MLSCN] Emory Chemical Biology Discovery Center in MLSCN Assay provider: Susan Smith, Emory Univers...
In DepthDetails PCBioAssay