BDBM553925 US11325905, Compound A44B29C50
SMILES CS(=O)(=O)c1ccc(NN2[C@H]3[C@@H](C=C[C@@H]2[C@H](O)c2ccc(Br)cc2)C(=O)N(C3=O)c2ccc(cc2)N2CCNCC2)cc1
InChI Key InChIKey=NYSYTFOJOLMVJR-OVHUPFAXSA-N
Data  1 IC50  1 Kd
  Tab Delimited (TSV)   2D SDfile   Computed 3D by Vconf -m prep SDfile
Find this compound or compounds like it in BindingDB:
Activity Spreadsheet -- Enzyme Inhibition Constant Data from BindingDB
Found 2 hits for monomerid = 553925
TargetBifunctional polynucleotide phosphatase/kinase(Human)
The Governors Of The University Of Alberta
US Patent
LigandPNGBDBM553925(US11325905, Compound A44B29C50)
Affinity DataIC50:  6.20E+3nM. Assay description: Kd values were measured by steady-state fluorescence spectroscopy, by following protein tryptophan fluorescence quenching as a function of ligand con...
Ligand InfoPC cidPC sid
In DepthDetails US Patent
TargetBifunctional polynucleotide phosphatase/kinase(Human)
The Governors Of The University Of Alberta
US Patent
LigandPNGBDBM553925(US11325905, Compound A44B29C50)
Affinity DataKd:  85nM. Assay description: Kd values were measured by steady-state fluorescence spectroscopy, by following protein tryptophan fluorescence quenching as a function of ligand con...
Ligand InfoPC cidPC sid
In DepthDetails US Patent