BDBM553964 US11325906, Example 27
SMILES CNC(=O)c1ccc(cn1)N1CCN(Cc2ccc3nc(CC(F)(F)F)c(=O)[nH]c3c2)CC1
InChI Key InChIKey=GWWKGCCMZJXPIM-UHFFFAOYSA-N
Data  6 IC50
  Tab Delimited (TSV)   2D SDfile   Computed 3D by Vconf -m prep SDfile
Find this compound or compounds like it in BindingDB:
Activity Spreadsheet -- Enzyme Inhibition Constant Data from BindingDB
Found 6 hits for monomerid = 553964
TargetPoly [ADP-ribose] polymerase 1(Homo sapiens (Human))
Astrazeneca
US Patent
LigandPNGBDBM553964(US11325906, Example 27)
Affinity DataIC50:  7nM. Assay description: PARP1: Recombinant full length 6HIS tagged PARP1 protein was diluted to 6 nM with 50 mM Tris pH 8, 0.001% Triton X100, 10 mM MgCl2, 150 mM NaCl and i...
Ligand InfoPC cidPC sid
In DepthDetails US Patent
TargetPoly [ADP-ribose] polymerase 2(Homo sapiens (Human))
Astrazeneca
US Patent
LigandPNGBDBM553964(US11325906, Example 27)
Affinity DataIC50:  1.60E+4nM. Assay description: PARP2: Recombinant full length PARP2 protein was diluted to 6 nM with 50 mM Tris pH 8, 0.001% Triton X100, 10 mM MgCl2, 150 mM NaCl and incubated for...
Ligand InfoPC cidPC sid
In DepthDetails US Patent
TargetPotassium voltage-gated channel subfamily H member 2(Homo sapiens (Human))
Astrazeneca
US Patent
LigandPNGBDBM553964(US11325906, Example 27)
Affinity DataIC50:  2.60E+4nM. Assay description: Electrophysiological recordings (all performed at RT) from stably transfected CHO hKv11.1 cells were obtained using the Nanion Syncropatch 768PE. Tes...
Ligand InfoPC cidPC sid
In DepthDetails US Patent
TargetPoly [ADP-ribose] polymerase tankyrase-1(Homo sapiens (Human))
Astrazeneca
US Patent
LigandPNGBDBM553964(US11325906, Example 27)
Affinity DataIC50:  7.10E+4nM. Assay description: PARP5a: Recombinant PARP5a binding domain was diluted to 160 nM with 50 mM Tris pH 8, 0.001% Triton X100, 10 mM MgCl2, 150 mM NaCl and incubated for ...
Ligand InfoPC cidPC sid
In DepthDetails US Patent
TargetProtein mono-ADP-ribosyltransferase PARP6(Homo sapiens (Human))
Astrazeneca
US Patent
LigandPNGBDBM553964(US11325906, Example 27)
Affinity DataIC50: >1.00E+5nM. Assay description: PARP6: Recombinant full length GST tagged PARP6 protein was diluted to 160 nM with 50 mM Tris pH 8, 0.001% Triton X100, 10 mM MgCl2, 150 mM NaCl and ...
Ligand InfoPC cidPC sid
In DepthDetails US Patent
TargetProtein mono-ADP-ribosyltransferase PARP3(Homo sapiens (Human))
Astrazeneca
US Patent
LigandPNGBDBM553964(US11325906, Example 27)
Affinity DataIC50: >1.00E+5nM. Assay description: PARP3: Recombinant full length PARP3 protein was diluted to 100 nM with 50 mM Tris pH 8, 0.001% Triton X100, 10 mM MgCl2, 150 mM NaCl and incubated f...
Ligand InfoPC cidPC sid
In DepthDetails US Patent