BDBM555336 (R)-4-(4-((2-(3-(difluoromethyl)bicyclo[1.1.1]pentan-1-yl)-4,4-dimethylcyclohex-1-en-1-yl)methyl)piperazin-1-yl)-N-((4-((4-((2-hydroxyethyl)(methyl)amino)-1-(phenylthio)butan-2-yl)amino)-3-((trifluoromethyl)sulfonyl)phenyl)sulfonyl)benzamide::US11344546, Example 60
SMILES CN(CCO)CC[C@H](CSc1ccccc1)Nc1ccc(cc1S(=O)(=O)C(F)(F)F)S(=O)(=O)NC(=O)c1ccc(cc1)N1CCN(CC2=C(CC(C)(C)CC2)C23CC([H]C(F)F)(C2)C3)CC1
InChI Key InChIKey=GKCSYYZJWNHHJU-RWSVXUKPSA-N
Data  2 IC50
  Tab Delimited (TSV)   2D SDfile   Computed 3D by Vconf -m prep SDfile
Find this compound or compounds like it in BindingDB:
Activity Spreadsheet -- Enzyme Inhibition Constant Data from BindingDB
Found 2 hits for monomerid = 555336
TargetBcl2-associated agonist of cell death(Homo sapiens (Human))
Recurium Ip Holding
US Patent
LigandPNGBDBM555336((R)-4-(4-((2-(3-(difluoromethyl)bicyclo[1.1.1]pent...)
Affinity DataIC50: <10nM. Assay description: Table 2: Binding to Bcl-2 proteins Bcl-2, and Bcl-XL was also assessed using an HTRF assay. Background: FAM-Bak/Bad binds to surface pocket of the Bc...
Ligand InfoPC cidPC sid
In DepthDetails US Patent
TargetApoptosis regulator Bcl-2(Homo sapiens (Human))
Recurium Ip Holding
US Patent
LigandPNGBDBM555336((R)-4-(4-((2-(3-(difluoromethyl)bicyclo[1.1.1]pent...)
Affinity DataIC50: <10nM. Assay description: Table 2: Binding to Bcl-2 proteins Bcl-2, and Bcl-XL was also assessed using an HTRF assay. Background: FAM-Bak/Bad binds to surface pocket of the Bc...
Ligand InfoPC cidPC sid
In DepthDetails US Patent