BDBM55659 2-[2-[5-(4-methylphenyl)-4-phenyl-1,2,4-triazol-3-yl]-2-phenyl-hydrazinyl]-N-phenyl-2-sulfanylidene-ethanamide::2-[2-[5-(4-methylphenyl)-4-phenyl-1,2,4-triazol-3-yl]-2-phenylhydrazinyl]-N-phenyl-2-sulfanylideneacetamide::2-{2-[5-(4-methylphenyl)-4-phenyl-4H-1,2,4-triazol-3-yl]-2-phenylhydrazino}-N-phenyl-2-thioxoacetamide::MLS000703807::N-phenyl-2-[N'-phenyl-N'-[4-phenyl-5-(p-tolyl)-1,2,4-triazol-3-yl]hydrazino]-2-thioxo-acetamide::SMR000226915::cid_1825875
SMILES Cc1ccc(cc1)-c1nnc(N(NC(=S)C(=O)Nc2ccccc2)c2ccccc2)n1-c1ccccc1
InChI Key InChIKey=RZTJQNMYXHHCSC-UHFFFAOYSA-N
Data  1 IC50  1 EC50
  Tab Delimited (TSV)   2D SDfile   Computed 3D by Vconf -m prep SDfile
Find this compound or compounds like it in BindingDB:
Activity Spreadsheet -- Enzyme Inhibition Constant Data from BindingDB
Found 2 hits for monomerid = 55659
TargetStreptokinase A(Streptococcus pyogenes M1 GAS)
Broad Institute
Curated by PubChem BioAssay
LigandPNGBDBM55659(2-[2-[5-(4-methylphenyl)-4-phenyl-1,2,4-triazol-3-...)
Affinity DataEC50:  1.50E+5nM. Assay description: Keywords: Group A streptococcus, GAS, streptokinase, expression, virulence, inhibition, dose response, EC50 Assay Overview: The goal of this assa...
In DepthDetails PCBioAssay
TargetNeutrophil cytosol factor 1 [S99G](Homo sapiens (Human))
Emory University
Curated by PubChem BioAssay
LigandPNGBDBM55659(2-[2-[5-(4-methylphenyl)-4-phenyl-1,2,4-triazol-3-...)
Affinity DataIC50:  5.00E+4nM. Assay description: NIH Molecular Libraries Screening Centers Network [MLSCN] Emory Chemical Biology Discovery Center in MLSCN Assay provider: Susan Smith, Emory Univers...
In DepthDetails PCBioAssay