BDBM557762 (1S,3'R,6'R,7'S,11'S,12'R)-6-chloro-7'-(cis-5- (diethylamino)-1,3-dioxan-2-yl)-11',12'- dimethyl-3,4-dihydro-2H,15'H- spiro[naphthalene-1,22'- [20]oxa[13]thia[1,14]diazatetracyclo [14.7.2.0~3,6~.0~19,24~]pentacosa[16,18,24] trien]-15'-one 13',13'-dioxide OR::US11364248, Example 57::US11364248, Example 58
SMILES CCN(CC)[C@H]1CO[C@H](OC1)[C@H]1CCC[C@H](C)[C@@H](C)S(=O)(=O)NC(=O)c2ccc3OC[C@]4(CCCc5cc(Cl)ccc45)CN(C[C@@H]4CC[C@@H]14)c3c2
InChI Key InChIKey=NPEDSFUNDPEMIZ-OIBOVLAKSA-N
Data  2 IC50
  Tab Delimited (TSV)   2D SDfile   Computed 3D by Vconf -m prep SDfile
Find this compound or compounds like it in BindingDB:
Activity Spreadsheet -- Enzyme Inhibition Constant Data from BindingDB
Found 2 hits for monomerid = 557762
LigandPNGBDBM557762((1S,3'R,6'R,7'S,11'S,12'R)-6-chloro-7'-(cis-5- (di...)
Affinity DataIC50:  1.35nM. Assay description: The inhibition of the Mcl-1/Bim interaction was measured using a time-resolved fluorescence resonance energy transfer (TR-FRET) assay. The recombinan...
Ligand InfoPC cidPC sid
In DepthDetails US Patent
LigandPNGBDBM557762((1S,3'R,6'R,7'S,11'S,12'R)-6-chloro-7'-(cis-5- (di...)
Affinity DataIC50:  0.439nM. Assay description: The inhibition of the Mcl-1/Bim interaction was measured using a time-resolved fluorescence resonance energy transfer (TR-FRET) assay. The recombinan...
Ligand InfoPC cidPC sid
In DepthDetails US Patent