BDBM55778 3-[[[butyl(methyl)amino]-sulfanylidenemethyl]amino]-2-thiophenecarboxylic acid methyl ester::3-[[butyl(methyl)thiocarbamoyl]amino]thiophene-2-carboxylic acid methyl ester::MLS000730145::SMR000308421::cid_16193842::methyl 3-({[butyl(methyl)amino]carbonothioyl}amino)thiophene-2-carboxylate::methyl 3-[[butyl(methyl)carbamothioyl]amino]thiophene-2-carboxylate
SMILES CCCCN(C)C(=S)Nc1ccsc1C(=O)OC
InChI Key InChIKey=YNBOOAKXXNVRLF-UHFFFAOYSA-N
Data  1 IC50
  Tab Delimited (TSV)   2D SDfile   Computed 3D by Vconf -m prep SDfile
Find this compound or compounds like it in BindingDB:
Activity Spreadsheet -- Enzyme Inhibition Constant Data from BindingDB
Found 1 hit for monomerid = 55778
TargetNeutrophil cytosol factor 1 [S99G](Homo sapiens (Human))
Emory University
Curated by PubChem BioAssay
LigandPNGBDBM55778(3-[[[butyl(methyl)amino]-sulfanylidenemethyl]amino...)
Affinity DataIC50:  5.00E+4nM. Assay description: NIH Molecular Libraries Screening Centers Network [MLSCN] Emory Chemical Biology Discovery Center in MLSCN Assay provider: Susan Smith, Emory Univers...
In DepthDetails PCBioAssay