BDBM557810 US11365181, Compound 03044
SMILES Cc1cc(cc(C)c1NC(=O)CC(C)(C)C)N1CCCc2cc(Cl)sc2C1
InChI Key InChIKey=VXSYUZDFCLHPIX-UHFFFAOYSA-N
Data  1 EC50
  Tab Delimited (TSV)   2D SDfile   Computed 3D by Vconf -m prep SDfile
Find this compound or compounds like it in BindingDB:
Activity Spreadsheet -- Enzyme Inhibition Constant Data from BindingDB
Found 1 hit for monomerid = 557810
TargetPotassium voltage-gated channel subfamily KQT member 2(Homo sapiens (Human))
Shanghai Zhimeng Biopharma
US Patent
LigandPNGBDBM557810(US11365181, Compound 03044)
Affinity DataEC50:  57nM. Assay description: Cell preparation: CHO-KCNQ2 cells were cultured in a 175 cm2 culture flask, and when the cells was grown to a density of 60-80%, the culture medium w...
Ligand InfoPC cidPC sid
In DepthDetails US Patent