BDBM557842 US11365185, Example 24B
SMILES CC(C)c1cncc(Nc2c(cnn2C)-c2ccc(cn2)-c2ccc(cn2)C2(CC2)C(O)=O)n1
InChI Key InChIKey=AHENRFMTHLGPPL-UHFFFAOYSA-N
Data  1 KI  2 IC50
  Tab Delimited (TSV)   2D SDfile   Computed 3D by Vconf -m prep SDfile
Find this compound or compounds like it in BindingDB:
Activity Spreadsheet -- Enzyme Inhibition Constant Data from BindingDB
Found 3 hits for monomerid = 557842
TargetLysophosphatidic acid receptor 1(Homo sapiens (Human))
Eli Lilly
US Patent
LigandPNGBDBM557842(US11365185, Example 24B)
Affinity DataKi:  46.2nM. Assay description: The ability of a compound to inhibit binding of a ligand (1-(4′-(4-(((benzyloxy)carbonyl)amino)-3-methylisoxazol-5-yl)-[1,1′-biphenyl]-4-...
Ligand InfoPC cidPC sid
In DepthDetails US Patent
TargetLysophosphatidic acid receptor 1(Homo sapiens (Human))
Eli Lilly
US Patent
LigandPNGBDBM557842(US11365185, Example 24B)
Affinity DataIC50:  48nM. Assay description: A cDNA encoding the human LPAR1 receptor is synthesized and cloned into pDNA3 expression plasmid. The plasmid is transfected in U937 cells using Lipo...
Ligand InfoPC cidPC sid
In DepthDetails US Patent
TargetLysophosphatidic acid receptor 3(Homo sapiens (Human))
Eli Lilly
US Patent
LigandPNGBDBM557842(US11365185, Example 24B)
Affinity DataIC50:  2.76E+3nM. Assay description: A cDNA encoding the human LPAR3 receptor is synthesized and cloned into pDNA3 expression plasmid. The plasmid is transfected in U2OS cells using Lipo...
Ligand InfoPC cidPC sid
In DepthDetails US Patent