BDBM55873 3-methyl-N-(2-naphthalenyl)butanamide::3-methyl-N-(2-naphthyl)butyramide::3-methyl-N-2-naphthylbutanamide::3-methyl-N-naphthalen-2-yl-butanamide::3-methyl-N-naphthalen-2-ylbutanamide::MLS000737919::SMR000291753::cid_222943
SMILES CC(C)CC(=O)Nc1ccc2ccccc2c1
InChI Key InChIKey=XMJLQRVSPVGHAI-UHFFFAOYSA-N
Data  1 IC50
  Tab Delimited (TSV)   2D SDfile   Computed 3D by Vconf -m prep SDfile
Find this compound or compounds like it in BindingDB:
Activity Spreadsheet -- Enzyme Inhibition Constant Data from BindingDB
Found 1 hit for monomerid = 55873
TargetNeutrophil cytosol factor 1 [S99G](Homo sapiens (Human))
Emory University
Curated by PubChem BioAssay
LigandPNGBDBM55873(3-methyl-N-(2-naphthalenyl)butanamide | 3-methyl-N...)
Affinity DataIC50:  5.00E+4nM. Assay description: NIH Molecular Libraries Screening Centers Network [MLSCN] Emory Chemical Biology Discovery Center in MLSCN Assay provider: Susan Smith, Emory Univers...
In DepthDetails PCBioAssay