BDBM560931 5-((3',5'-dichloro-[1,1'- biphenyl]-3-yl)oxy)- 1H-1,2,3-triazole-4- carboxylic acid::US11389456, Ex. No. I-302
SMILES Clc1cc(Cl)cc(c1)-c1cccc(Oc2cnn[nH]2)c1
InChI Key InChIKey=XKSJXBCYLVBOAJ-UHFFFAOYSA-N
Data  1 IC50
  Tab Delimited (TSV)   2D SDfile   Computed 3D by Vconf -m prep SDfile
Find this compound or compounds like it in BindingDB:
Activity Spreadsheet -- Enzyme Inhibition Constant Data from BindingDB
Found 1 hit for monomerid = 560931
Target2-Hydroxyacid oxidase 1(Homo sapiens (Human))
Oxalurx
US Patent
LigandPNGBDBM560931(5-((3',5'-dichloro-[1,1'- biphenyl]-3-yl)oxy)- 1H-...)
Affinity DataIC50:  3nM. Assay description: The in-vitro glycolate oxidase assay was performed using recombinant full-length human hydroxyacid oxidase 1 (HAO1), the equivalent of hGOX. The enzy...
Ligand InfoPC cidPC sid
In DepthDetails US Patent