BDBM563274 US11407740, Compound 192
SMILES COC(=O)C(Cc1nc[nH]c(=O)c1O)N1Cc2cc(cn2C1=O)C#Cc1ccc(CN2CCOCC2)cc1
InChI Key
Data  1 IC50
  Tab Delimited (TSV)   2D SDfile   Computed 3D by Vconf -m prep SDfile
Find this compound or compounds like it in BindingDB:
Activity Spreadsheet -- Enzyme Inhibition Constant Data from BindingDB
Found 1 hit for monomerid = 563274
TargetUDP-3-O-acyl-N-acetylglucosamine deacetylase(Escherichia coli)
Forge Therapeutics
US Patent
LigandPNGBDBM563274(US11407740, Compound 192)
Affinity DataIC50:  30nM. Assay description: IC50 values against E. coli LpxC were determined using a Rapid Fire MS assay as previously described J. Med. Chem. 2012, 55, 1662-1670.
Ligand InfoPC cidPC sid
In DepthDetails US Patent