BDBM565266 US11414416, Compound D7::US11560381, Compound D7
SMILES COc1cc(cc(OC)c1CN1CC(C1)C(=O)NCCOCCOCCNc1cccc2C(=O)N(C3CCC(=O)NC3=O)C(=O)c12)-c1cn(C)c(=O)c2cnccc12
InChI Key InChIKey=YJFTYDBNVCLRAD-UHFFFAOYSA-N
Data  3 IC50
  Tab Delimited (TSV)   2D SDfile   Computed 3D by Vconf -m prep SDfile
Find this compound or compounds like it in BindingDB:
Activity Spreadsheet -- Enzyme Inhibition Constant Data from BindingDB
Found 3 hits for monomerid = 565266
TargetProtein SSX2/Protein SSXT(Human)
Foghorn Therapeutics
US Patent
LigandPNGBDBM565266(US11414416, Compound D7 | US11560381, Compound D7)
Affinity DataIC50:  55nM. Assay description: This example demonstrates the ability of the compounds of the disclosure to degrade a Nano luciferase-BRO9 fusion protein in a cell-based degradation...
Ligand InfoPC cidPC sid
In DepthDetails US Patent
TargetBromodomain-containing protein 9 [133-239](Homo sapiens (Human))
Foghorn Therapeutics
US Patent
LigandPNGBDBM565266(US11414416, Compound D7 | US11560381, Compound D7)
Affinity DataIC50: <10nM. Assay description: A mixture of biotinylated-ligand and SureLight Allophycocyanin-Streptavidin (APC-SA, PerkinElmer AD0201) in 50 mM HEPES (pH 7.4), 50 mM NaCl, 1 mM TC...
Ligand InfoPC cidPC sid
In DepthDetails US Patent
TargetBromodomain-containing protein 9 [133-239](Homo sapiens (Human))
Foghorn Therapeutics
US Patent
LigandPNGBDBM565266(US11414416, Compound D7 | US11560381, Compound D7)
Affinity DataIC50: <10nM. Assay description: Procedure: His-Flag-BRD9 (P133-K239; Swiss Prot Q9H8M2; SEQ ID NO:1 mgsshhhhhhenlyfq/gdykddddkgslevlfqg/PAENESTPIQQLLEHFLRQLQRKDPHGFFAFPVTDAIAPGYSMII...
Ligand InfoPC cidPC sid
In DepthDetails US Patent