BDBM565270 (2S)-1-[[2,6-dimethoxy-4-(2-methyl-1-oxo-2,7-naphthyridin-4-yl)phenyl]methyl]-N-(8-[[2-(2,6-dioxopiperidin-3-yl)-1,3-dioxoisoindol-4-yl]amino]octyl)azetidine-2-carboxamide ::US11414416, Compound D11::US11560381, Compound D11
SMILES COc1cc(cc(OC)c1CN1CC[C@H]1C(=O)NCCCCCCCCNc1cccc2C(=O)N(C3CCC(=O)NC3=O)C(=O)c12)-c1cn(C)c(=O)c2cnccc12
InChI Key InChIKey=GVWZEBMFVZAINC-CDRRMRQFSA-N
Data  3 IC50
  Tab Delimited (TSV)   2D SDfile   Computed 3D by Vconf -m prep SDfile
Find this compound or compounds like it in BindingDB:
Activity Spreadsheet -- Enzyme Inhibition Constant Data from BindingDB
Found 3 hits for monomerid = 565270
TargetProtein SSX2/Protein SSXT(Human)
Foghorn Therapeutics
US Patent
LigandPNGBDBM565270((2S)-1-[[2,6-dimethoxy-4-(2-methyl-1-oxo-2,7-napht...)
Affinity DataIC50: <10nM. Assay description: This example demonstrates the ability of the compounds of the disclosure to degrade a Nano luciferase-BRO9 fusion protein in a cell-based degradation...
Ligand InfoPC cidPC sid
In DepthDetails US Patent
TargetBromodomain-containing protein 9 [133-239](Homo sapiens (Human))
Foghorn Therapeutics
US Patent
LigandPNGBDBM565270((2S)-1-[[2,6-dimethoxy-4-(2-methyl-1-oxo-2,7-napht...)
Affinity DataIC50: >10nM. Assay description: A mixture of biotinylated-ligand and SureLight Allophycocyanin-Streptavidin (APC-SA, PerkinElmer AD0201) in 50 mM HEPES (pH 7.4), 50 mM NaCl, 1 mM TC...
Ligand InfoPC cidPC sid
In DepthDetails US Patent
TargetBromodomain-containing protein 9 [133-239](Homo sapiens (Human))
Foghorn Therapeutics
US Patent
LigandPNGBDBM565270((2S)-1-[[2,6-dimethoxy-4-(2-methyl-1-oxo-2,7-napht...)
Affinity DataIC50:  55nM. Assay description: Procedure: His-Flag-BRD9 (P133-K239; Swiss Prot Q9H8M2; SEQ ID NO:1 mgsshhhhhhenlyfq/gdykddddkgslevlfqg/PAENESTPIQQLLEHFLRQLQRKDPHGFFAFPVTDAIAPGYSMII...
Ligand InfoPC cidPC sid
In DepthDetails US Patent