BDBM565303 5-(4-(((2,6-dimethoxy-4-(2-methyl-1-oxo-1,2-dihydro-2,7-naphthyridin-4-yl)benzyl)(methyl)amino)methyl)-1H-1,2,3-triazol-1-yl)-2-(2,6-dioxopiperidin-3-yl)isoindoline-1,3-dione ::US11414416, Compound D62::US11560381, Compound D62
SMILES COc1cc(cc(OC)c1CN(C)Cc1cn(nn1)-c1ccc2C(=O)N(C3CCC(=O)NC3=O)C(=O)c2c1)-c1cn(C)c(=O)c2cnccc12
InChI Key InChIKey=WSSCIZFVUUISJR-UHFFFAOYSA-N
Data  3 IC50
  Tab Delimited (TSV)   2D SDfile   Computed 3D by Vconf -m prep SDfile
Find this compound or compounds like it in BindingDB:
Activity Spreadsheet -- Enzyme Inhibition Constant Data from BindingDB
Found 3 hits for monomerid = 565303
TargetProtein SSX2/Protein SSXT(Human)
Foghorn Therapeutics
US Patent
LigandPNGBDBM565303(5-(4-(((2,6-dimethoxy-4-(2-methyl-1-oxo-1,2-dihydr...)
Affinity DataIC50:  550nM. Assay description: This example demonstrates the ability of the compounds of the disclosure to degrade a Nano luciferase-BRO9 fusion protein in a cell-based degradation...
Ligand InfoPC cidPC sid
In DepthDetails US Patent
TargetBromodomain-containing protein 9 [133-239](Homo sapiens (Human))
Foghorn Therapeutics
US Patent
LigandPNGBDBM565303(5-(4-(((2,6-dimethoxy-4-(2-methyl-1-oxo-1,2-dihydr...)
Affinity DataIC50: >10nM. Assay description: A mixture of biotinylated-ligand and SureLight Allophycocyanin-Streptavidin (APC-SA, PerkinElmer AD0201) in 50 mM HEPES (pH 7.4), 50 mM NaCl, 1 mM TC...
Ligand InfoPC cidPC sid
In DepthDetails US Patent
TargetBromodomain-containing protein 9 [133-239](Homo sapiens (Human))
Foghorn Therapeutics
US Patent
LigandPNGBDBM565303(5-(4-(((2,6-dimethoxy-4-(2-methyl-1-oxo-1,2-dihydr...)
Affinity DataIC50:  55nM. Assay description: Procedure: His-Flag-BRD9 (P133-K239; Swiss Prot Q9H8M2; SEQ ID NO:1 mgsshhhhhhenlyfq/gdykddddkgslevlfqg/PAENESTPIQQLLEHFLRQLQRKDPHGFFAFPVTDAIAPGYSMII...
Ligand InfoPC cidPC sid
In DepthDetails US Patent