BDBM570525 [4-(propan-2-yloxy)phenyl]methyl N-[(3R,4S)-3-fluoro-1-methylpiperidin-4-yl]-N-[(4-fluorophenyl)methyl]carbamate (4a)::US11440884, Example 4a
SMILES CC(C)Oc1ccc(COC(=O)N(Cc2ccc(F)cc2)[C@H]2CCN(C)C[C@H]2F)cc1
InChI Key InChIKey=QMPLMLQOCFBDRN-PKTZIBPZSA-N
Data  1 KI
  Tab Delimited (TSV)   2D SDfile   Computed 3D by Vconf -m prep SDfile
Find this compound or compounds like it in BindingDB:
Activity Spreadsheet -- Enzyme Inhibition Constant Data from BindingDB
Found 1 hit for monomerid = 570525
Target5-hydroxytryptamine receptor 2A(Homo sapiens (Human))
Acadia Pharmaceuticals
US Patent
LigandPNGBDBM570525( [4-(propan-2-yloxy)phenyl]methyl N-[(3R,4S)-3-flu...)
Affinity DataKi:  0.100nM. Assay description: R-SAT's were generally performed with 50 ng/well of receptor and 20 ng/well of β-galactosidase plasmid DNA. All receptor constructs used wer...
Ligand InfoPC cidPC sid
In DepthDetails US Patent