BDBM570567 US11440884, Example 28
SMILES CN1CCC(CC1)N(Cc1ccc(F)cc1F)C(=O)OCc1ccc(OC(CF)CF)cc1
InChI Key InChIKey=YQSXZGVURBXISD-UHFFFAOYSA-N
Data  1 KI
  Tab Delimited (TSV)   2D SDfile   Computed 3D by Vconf -m prep SDfile
Find this compound or compounds like it in BindingDB:
Activity Spreadsheet -- Enzyme Inhibition Constant Data from BindingDB
Found 1 hit for monomerid = 570567
Target5-hydroxytryptamine receptor 2A(Homo sapiens (Human))
Acadia Pharmaceuticals
US Patent
LigandPNGBDBM570567(US11440884, Example 28)
Affinity DataKi:  0.0790nM. Assay description: R-SAT's were generally performed with 50 ng/well of receptor and 20 ng/well of β-galactosidase plasmid DNA. All receptor constructs used wer...
Ligand InfoPC cidPC sid
In DepthDetails US Patent