BDBM570574 US11440884, Example 35
SMILES COc1cc(F)c(F)cc1CN(C1CCN(C)CC1)C(=O)OCc1ccc(OCC(C)C)cc1
InChI Key InChIKey=LQWYYOIKZUJASE-UHFFFAOYSA-N
Data  1 KI
  Tab Delimited (TSV)   2D SDfile   Computed 3D by Vconf -m prep SDfile
Find this compound or compounds like it in BindingDB:
Activity Spreadsheet -- Enzyme Inhibition Constant Data from BindingDB
Found 1 hit for monomerid = 570574
Target5-hydroxytryptamine receptor 2A(Homo sapiens (Human))
Acadia Pharmaceuticals
US Patent
LigandPNGBDBM570574(US11440884, Example 35)
Affinity DataKi:  0.100nM. Assay description: R-SAT's were generally performed with 50 ng/well of receptor and 20 ng/well of β-galactosidase plasmid DNA. All receptor constructs used wer...
Ligand InfoPC cidPC sid
In DepthDetails US Patent