BDBM570909 US11440904, Compound 7
SMILES C=CC(=O)Nc1cccc(Nc2nc(Nc3ccc4OCCOCCOCCOc4c3)nc3[nH]cnc23)c1
InChI Key InChIKey=IZLUBQPWEKVIDI-UHFFFAOYSA-N
Data  16 IC50
  Tab Delimited (TSV)   2D SDfile   Computed 3D by Vconf -m prep SDfile
Find this compound or compounds like it in BindingDB:
Activity Spreadsheet -- Enzyme Inhibition Constant Data from BindingDB
Found 16 hits for monomerid = 570909
TargetCytoplasmic tyrosine-protein kinase BMX(Homo sapiens (Human))
Milstein Zhang & Wu
US Patent
LigandPNGBDBM570909(US11440904, Compound 7)
Affinity DataIC50:  0.410nM. Assay description: The inhibiting activities of each of Compound-1 to Compound-24 against BTK wt, BTK(C481S), BMX, FAK, ITK, and EGFR wt kinases were determined using 3...
Ligand InfoPC cidPC sid
In DepthDetails US Patent
TargetTyrosine-protein kinase ITK/TSK(Homo sapiens (Human))
Milstein Zhang & Wu
US Patent
LigandPNGBDBM570909(US11440904, Compound 7)
Affinity DataIC50:  1.35nM. Assay description: The inhibiting activities of each of Compound-1 to Compound-24 against BTK wt, BTK(C481S), BMX, FAK, ITK, and EGFR wt kinases were determined using 3...
Ligand InfoPC cidPC sid
In DepthDetails US Patent
TargetTyrosine-protein kinase BTK [C481S](Homo sapiens (Human))
Milstein Zhang & Wu
US Patent
LigandPNGBDBM570909(US11440904, Compound 7)
Affinity DataIC50:  324nM. Assay description: The inhibiting activities of each of Compound-1 to Compound-24 against BTK wt, BTK(C481S), BMX, FAK, ITK, and EGFR wt kinases were determined using 3...
Ligand InfoPC cidPC sid
In DepthDetails US Patent
TargetEpidermal growth factor receptor(Homo sapiens (Human))
Milstein Zhang & Wu
US Patent
LigandPNGBDBM570909(US11440904, Compound 7)
Affinity DataIC50:  208nM. Assay description: The inhibiting activities of each of Compound-1 to Compound-24 against BTK wt, BTK(C481S), BMX, FAK, ITK, and EGFR wt kinases were determined using 3...
Ligand InfoPC cidPC sid
In DepthDetails US Patent
TargetFocal adhesion kinase 1(Homo sapiens (Human))
Milstein Zhang & Wu
US Patent
LigandPNGBDBM570909(US11440904, Compound 7)
Affinity DataIC50:  274nM. Assay description: The inhibiting activities of each of Compound-1 to Compound-24 against BTK wt, BTK(C481S), BMX, FAK, ITK, and EGFR wt kinases were determined using 3...
Ligand InfoPC cidPC sid
In DepthDetails US Patent
TargetTyrosine-protein kinase ITK/TSK(Homo sapiens (Human))
Milstein Zhang & Wu
US Patent
LigandPNGBDBM570909(US11440904, Compound 7)
Affinity DataIC50:  1.35nM. Assay description: The inhibiting activities of each of Compound-1 to Compound-24 against BTK wt, BTK(C481S), BMX, FAK, ITK, and EGFR wt kinases were determined using 3...
Ligand InfoPC cidPC sid
In DepthDetails US Patent
TargetTyrosine-protein kinase BTK(Homo sapiens (Human))
Milstein Zhang & Wu
US Patent
LigandPNGBDBM570909(US11440904, Compound 7)
Affinity DataIC50:  0.650nM. Assay description: The inhibiting activities of each of Compound-1 to Compound-24 against BTK wt, BTK(C481S), BMX, FAK, ITK, and EGFR wt kinases were determined using 3...
Ligand InfoPC cidPC sid
In DepthDetails US Patent
TargetTyrosine-protein kinase BTK [C481S](Homo sapiens (Human))
Milstein Zhang & Wu
US Patent
LigandPNGBDBM570909(US11440904, Compound 7)
Affinity DataIC50:  675nM. Assay description: The inhibiting activities of each of Compound-1 to Compound-24 against BTK wt, BTK(C481S), BMX, FAK, ITK, and EGFR wt kinases were determined using 3...
Ligand InfoPC cidPC sid
In DepthDetails US Patent
TargetEpidermal growth factor receptor(Homo sapiens (Human))
Milstein Zhang & Wu
US Patent
LigandPNGBDBM570909(US11440904, Compound 7)
Affinity DataIC50:  208nM. Assay description: The inhibiting activities of each of Compound-1 to Compound-24 against BTK wt, BTK(C481S), BMX, FAK, ITK, and EGFR wt kinases were determined using 3...
Ligand InfoPC cidPC sid
In DepthDetails US Patent
TargetFocal adhesion kinase 1(Homo sapiens (Human))
Milstein Zhang & Wu
US Patent
LigandPNGBDBM570909(US11440904, Compound 7)
Affinity DataIC50:  274nM. Assay description: The inhibiting activities of each of Compound-1 to Compound-24 against BTK wt, BTK(C481S), BMX, FAK, ITK, and EGFR wt kinases were determined using 3...
Ligand InfoPC cidPC sid
In DepthDetails US Patent
TargetTyrosine-protein kinase BTK(Homo sapiens (Human))
Milstein Zhang & Wu
US Patent
LigandPNGBDBM570909(US11440904, Compound 7)
Affinity DataIC50:  0.650nM. Assay description: The inhibiting activities of each of Compound-1 to Compound-24 against BTK wt, BTK(C481S), BMX, FAK, ITK, and EGFR wt kinases were determined using 3...
Ligand InfoPC cidPC sid
In DepthDetails US Patent
TargetTyrosine-protein kinase BTK [C481S](Homo sapiens (Human))
Milstein Zhang & Wu
US Patent
LigandPNGBDBM570909(US11440904, Compound 7)
Affinity DataIC50:  675nM. Assay description: The inhibiting activities of each of Compound-1 to Compound-24 against BTK wt, BTK(C481S), BMX, FAK, ITK, and EGFR wt kinases were determined using 3...
Ligand InfoPC cidPC sid
In DepthDetails US Patent
TargetFocal adhesion kinase 1(Homo sapiens (Human))
Milstein Zhang & Wu
US Patent
LigandPNGBDBM570909(US11440904, Compound 7)
Affinity DataIC50:  274nM. Assay description: The inhibiting activities of each of Compound-1 to Compound-24 against BTK wt, BTK(C481S), BMX, FAK, ITK, and EGFR wt kinases were determined using 3...
Ligand InfoPC cidPC sid
In DepthDetails US Patent
TargetEpidermal growth factor receptor(Homo sapiens (Human))
Milstein Zhang & Wu
US Patent
LigandPNGBDBM570909(US11440904, Compound 7)
Affinity DataIC50:  208nM. Assay description: The inhibiting activities of each of Compound-1 to Compound-24 against BTK wt, BTK(C481S), BMX, FAK, ITK, and EGFR wt kinases were determined using 3...
Ligand InfoPC cidPC sid
In DepthDetails US Patent
TargetCytoplasmic tyrosine-protein kinase BMX(Homo sapiens (Human))
Milstein Zhang & Wu
US Patent
LigandPNGBDBM570909(US11440904, Compound 7)
Affinity DataIC50:  0.410nM. Assay description: The inhibiting activities of each of Compound-1 to Compound-24 against BTK wt, BTK(C481S), BMX, FAK, ITK, and EGFR wt kinases were determined using 3...
Ligand InfoPC cidPC sid
In DepthDetails US Patent
TargetTyrosine-protein kinase BTK(Homo sapiens (Human))
Milstein Zhang & Wu
US Patent
LigandPNGBDBM570909(US11440904, Compound 7)
Affinity DataIC50:  0.650nM. Assay description: The inhibiting activities of each of Compound-1 to Compound-24 against BTK wt, BTK(C481S), BMX, FAK, ITK, and EGFR wt kinases were determined using 3...
Ligand InfoPC cidPC sid
In DepthDetails US Patent