BDBM576212 WO2022094012, Example 16
SMILES CCN1[C@H](C)c2cccc(c2)-c2cn3ccnc3c(OC(C)CCN(C)CCNC1=O)n2
InChI Key InChIKey=BOOZZSYJAJYHOK-QRWMCTBCSA-N
Data  1 EC50
  Tab Delimited (TSV)   2D SDfile   Computed 3D by Vconf -m prep SDfile
Find this compound or compounds like it in BindingDB:
Activity Spreadsheet -- Enzyme Inhibition Constant Data from BindingDB
Found 1 hit for monomerid = 576212
TargetOrexin receptor type 2(Homo sapiens (Human))
Merck Sharp &Amp
WIPO
LigandPNGBDBM576212(WO2022094012, Example 16)
Affinity DataEC50:  3.88E+3nM. Assay description:  In a typical experiment, the OX1 and OX2 receptor agonist activity is determined in accordance with the following general experimental method. Chine...
Ligand InfoPC cidPC sid
In DepthDetails PubMed