BDBM576247 WO2022109580, Example 6
SMILES CO[C@@]1(CCOC1)c1cc(C)cc(n1)-n1nc(C)c2cnc(NC(N)=O)cc12
InChI Key InChIKey=OBKLMYOIOLRTKZ-LJQANCHMSA-N
Data  1 IC50
  Tab Delimited (TSV)   2D SDfile   Computed 3D by Vconf -m prep SDfile
Find this compound or compounds like it in BindingDB:
Activity Spreadsheet -- Enzyme Inhibition Constant Data from BindingDB
Found 1 hit for monomerid = 576247
TargetNon-receptor tyrosine-protein kinase TYK2 [556-871](Homo sapiens (Human))
Janssen Pharmaceutica
WIPO
LigandPNGBDBM576247(WO2022109580, Example 6)
Affinity DataIC50:  8nM. Assay description: The probe displacement assay is conducted as follows: In a 384-well plate, test compound along with recombinantly expressed His-tagged protein corres...
Ligand InfoPC cidPC sid
In DepthDetails PubMed