BDBM576335 WO2022112188, Example 17
SMILES CC(C)(c1ccc(o1)C(=O)NC1CC2(C1)CC(C2)c1nc2cc(Cl)ccc2s1)S(C)(=O)=O
InChI Key InChIKey=DOGJLOFKYIXJJN-UHFFFAOYSA-N
Data  2 IC50
  Tab Delimited (TSV)   2D SDfile   Computed 3D by Vconf -m prep SDfile
Find this compound or compounds like it in BindingDB:
Activity Spreadsheet -- Enzyme Inhibition Constant Data from BindingDB
Found 2 hits for monomerid = 576335
TargetExternal core antigen(HBVgbn)
F. Hoffmann-La Roche
WIPO
LigandPNGBDBM576335(WO2022112188, Example 17)
Affinity DataIC50:  1.60E+3nM. Assay description: Detailed procedures regarding primary human hepatocyte (PHH) HBV natural infection assay are described as below. One tube of frozen PHH (10 million c...
Ligand InfoPC cidPC sid
In DepthDetails PubMed
TargetLarge envelope protein(Hepatitis B virus)
F. Hoffmann-La Roche
WIPO
LigandPNGBDBM576335(WO2022112188, Example 17)
Affinity DataIC50:  2.11E+3nM. Assay description: Detailed procedures regarding primary human hepatocyte (PHH) HBV natural infection assay are described as below. One tube of frozen PHH (10 million c...
Ligand InfoPC cidPC sid
In DepthDetails PubMed