BDBM576388 N-[6-(5-chloro-1,3-benzoxazol-2-yl)spiro[3.3]heptan-2-yl]-5-cyclopropylsulfonyl-furan-2-carboxamide::WO2022112207, Example 17
SMILES Clc1ccc2oc(nc2c1)C1CC2(CC(C2)NC(=O)c2ccc(o2)S(=O)(=O)C2CC2)C1
InChI Key InChIKey=YYOMHFRXZWJASD-UHFFFAOYSA-N
Data  2 IC50
  Tab Delimited (TSV)   2D SDfile   Computed 3D by Vconf -m prep SDfile
Find this compound or compounds like it in BindingDB:
Activity Spreadsheet -- Enzyme Inhibition Constant Data from BindingDB
Found 2 hits for monomerid = 576388
TargetExternal core antigen(HBVgbn)
F. Hoffmann-La Roche
WIPO
LigandPNGBDBM576388(N-[6-(5-chloro-1,3-benzoxazol-2-yl)spiro[3.3]hepta...)
Affinity DataIC50:  177nM. Assay description: Detailed procedures regarding primary human hepatocyte (PHH) HBV natural infection assay are described as below. One tube of frozen PHH (10 million c...
Ligand InfoPC cidPC sid
In DepthDetails PubMed
TargetLarge envelope protein(Hepatitis B virus)
F. Hoffmann-La Roche
WIPO
LigandPNGBDBM576388(N-[6-(5-chloro-1,3-benzoxazol-2-yl)spiro[3.3]hepta...)
Affinity DataIC50:  275nM. Assay description: Detailed procedures regarding primary human hepatocyte (PHH) HBV natural infection assay are described as below. One tube of frozen PHH (10 million c...
Ligand InfoPC cidPC sid
In DepthDetails PubMed